{"text_format":"1","workbook":"xlsx","n_sheets":6,"sheets":["vers","Readme","Calculations","Sheet1","Models","Economic Data"],"not_rendered":{"charts":15,"images":1,"macros":0,"external_links":0,"defined_names":223,"comments":1,"pivot_tables":0},"unopened":[],"bounds":{"document_bytes":16777216,"sheet_cells":100000,"rows_first":2000,"rows_last":500,"rows_between":2000,"halvings":0,"cell_chars":16384,"cell_head_chars":4096},"cells_cut":0,"cells_raw":0,"read":"whole","date_system":"1900"}

{"sheet":"vers","index":0,"n_rows":4,"n_cols":2,"rows_kept":4,"cut":false,"hidden":false,"merged":[]}
[]
[]
["v7","made after call w Alan 10/5\npurpose is to test a nonparametric model and implement some kind of overfitting testing "]
["v8","dropped extra name of Quadratic model, this one is just the quadratic model\nidentified circular references and cleaned it up"]

{"sheet":"Readme","index":1,"n_rows":34,"n_cols":12,"rows_kept":34,"cut":false,"hidden":false,"merged":[]}
[null,null,null,null,null,null,null,null,null,null,null,"Other papers and sources"]
[]
[null,null,null,null,null,null,null,null,null,null,null,"Beyond the Correlation Matrix: Guy Carpenter"]
[null,null,null,null,null,null,null,null,null,null,null,"https://www.casact.org/education/reinsure/2011/handouts/C2-Mango.pdf"]
[null,null,null,null,null,null,null,null,null,null,null,"Ppt slides on pros/cons of correlation matrix usage in capital models."]
[null,null,null,null,null,null,null,null,null,null,null,"Don Mango - no longer with GC, not sure who else there would have experience in this space."]
[]
[null,null,null,null,null,null,null,null,null,null,null,"Moving Beyond History: A loss driver approach..."]
[null,null,null,null,null,null,null,null,null,null,null,"https://www.casact.org/education/reinsure/2014/handouts/Paper_3349_handout_2145_0.pdf"]
[null,null,null,null,null,null,null,null,null,null,null,"Eric Huang, Swiss Re"]
[null,null,null,null,null,null,null,null,null,null,null,"Focuses on casualty risks, casuatly loss drivers. Like Praedicat."]
[]
[null,null,null,null,null,null,null,null,null,null,null,"Common Poisson Shock Models"]
[null,null,null,null,null,null,null,null,null,null,null,"https://www.casact.org/library/astin/vol33no2/209.pdf"]
[null,null,null,null,null,null,null,null,null,null,null,"Filip Lindskog"]
{"$rows_left_out":20}
{"sheet":"Calculations","index":2,"n_rows":1008,"n_cols":84,"rows_kept":1008,"cut":false,"hidden":false,"merged":[[5,55,5,57],[34,1,34,3],[2,69,2,78],[34,13,34,17],[33,13,33,17],[5,13,7,13],[6,14,6,15],[6,16,6,17],[7,51,7,52],[5,45,5,49],[5,51,5,53],[5,60,5,64],[5,66,5,67],[5,1,7,1],[6,2,6,3],[33,1,33,3],[6,18,6,19],[53,23,53,26],[53,22,54,22],[3,1,3,4]]}
[]
[]
[null,null,null,null,null,null,null,null,null,null,null,null,null,"Historical Data",null,null,"Table 1",null,null,null,null,null,null,null,null,null,null,null,null,null,null,null,null,null,null,null,null,null,null,null,null,null,null,null,null,null,"S&P 500 Prediction"]
[null,"Text Table 1",null,null,null,null,null,null,null,null,null,null,null,null,null,null,null,null,null,null,null,null,null,null,null,null,null,null,null,null,null,null,null,null,null,null,null,null,null,null,null,null,null,null,null,null,{"$f":"'Economic Data'!AI5","v":1845.1656010000002}]
[]
[null,"AY",-1,{"$f":"-1+C6","v":-2},-3,null,null,null,null,null,null,null,null,"AY",-1,{"$f":"-1+O6","v":-2},{"$f":"-1+P6","v":-3},-4,-5,-6,null,null,null,null,null,null,null,null,null,null,null,null,null,null,null,null,null,null,null,null,null,null,null,null,null,"Simulated S&P Index and Error",null,null,null,null,null,"Final Values for Beta Distribution",null,null,null,"Revised yerr distribution",null,null,null,null,"Fitting Beta Parameters",null,null,null,null,null,"Elements of <LRidio>"]
[null,null,"Loss Ratio (LR)",null,null,null,null,null,null,null,null,null,null,null,"S&P Index",null,"Loss Ratio (LR)",null,"Observed Error",null,null,null,null,null,null,null,null,null,null,null,null,null,null,null,null,null,null,null,null,null,null,null,null,null,null,{"$f":"-1","v":-1},{"$f":"-1+AT7","v":-2},{"$f":"-1+AU7","v":-3},-4,-4,null,-5,{"$f":"-1+AZ7","v":-6},-7,null,-8,{"$f":"-1+BD7","v":-9},-10,null,null,{"$f":"-1+BF7","v":-11},null,{"$f":"-1+BI7","v":-12},{"$f":"-1+BK7","v":-13},{"$f":"-1+BL7","v":-14},null,-15,{"$f":"-1+BO7","v":-16}]
[null,null,"Planned","Observed","LRerr\nObs",null,null,null,null,null,null,null,null,null,"Predicted","Observed","Planned","Observed","                                                    ",null,null,null,null,null,null,null,null,null,null,null,"Polynomial regression","Coeff",null,"LRerr Obs","LRerr Pred","QQ",null,null,null,null,null,null,null,null,null,"Sim","S&P 500 Simulation",null,{"$f":"Models!#REF!","v":{"$error":"#REF!"}},null,null,"\nBeta parameters",null,"Solver constraints",null,"U",null,null,null,null,"Selected CDF levels","LRerr Obs",null,null,"error",null,"<LRpred>","<LRidio>",null,null,null,null,null,null,null,null,null,null,null,null,"Beta"]
[null,1990,60.301493499999999,62.3959726,{"$f":"D9/C9","v":1.0347334531606585},null,null,null,null,null,null,null,null,1990,{"$f":"INDEX('Economic Data'!$AI$2:$AI$29,MATCH(N9,'Economic Data'!$AA$2:$AA$29,0))","v":359.66},328.75,{"$f":"C9","v":60.301493499999999},{"$f":"D9","v":62.3959726},{"$f":"P9/O9","v":0.91405772118111539},{"$f":"R9/Q9","v":1.0347334531606585},null,null,null,null,null,null,null,null,null,null,"b2",{"$f":"TRANSPOSE(LINEST(T9:T32,S9:S32^{1,2}))","v":1.0967216027240845},null,{"$f":"T9","v":1.0347334531606585},{"$f":"$AF$11+$AF$10*S9+$AF$9*S9^2","v":1.0356608872110742},{"$f":"_xlfn.PERCENTRANK.INC(AH$9:AH$32,AH9)","v":0.52100000000000002},{"$f":"_xlfn.PERCENTRANK.INC(AI$9:AI$32,AI9)","v":0.82599999999999996},null,null,null,null,null,null,null,null,1,1291.5596828287421,{"$f":"AU9/$AU$4","v":0.69996952150461322},{"$error":"#REF!"},{"$f":"$AF$11+$AF$10*AV9+$AF$9*AV9^2","v":1.195386756878219},null,"minY",0.19619187604720059,0.05,null,0.12760057455301285,{"$f":"_xlfn.BETA.INV(BD9,$BA$11,$BA$12,$BA$9,$BA$10)","v":0.72344461426229056},{"$f":"AX9*BE9","v":0.86479611122401367},{"$f":"_xlfn.LOGNORM.INV(BD9,$H$15,$H$14)","v":0.72110984364471942},null,1E-3,"na",{"$f":"_xlfn.LOGNORM.INV(BI9,$H$15,$H$14)","v":0.43567091200616342},{"$f":"_xlfn.PERCENTILE.INC($BF$9:$BF$1008,BI9)","v":0.43435080367890866},{"$f":"ABS(BL9-BK9)^2","v":1.7426859956873746E-6},null,{"$f":"_xlfn.PERCENTILE.INC($AX$9:$AX$1008,$BI9)","v":0.97607289070598935},{"$f":"_xlfn.PERCENTILE.INC($BE$9:$BE$1008,$BI9)","v":0.43269771112740141},null,null,"St. Dev.",null,null,null,null,null,null,null,null,null,"xU","x","beta(x)","ln(x)"]
[null,1991,69.998378599999995,59.101737300000003,0.84433008995439796,null,null,null,null,null,null,null,null,1991,{"$f":"INDEX('Economic Data'!$AI$2:$AI$29,MATCH(N10,'Economic Data'!$AA$2:$AA$29,0))","v":364.08528799999999},388.51,{"$f":"C10","v":69.998378599999995},59.101737300000003,{"$f":"P10/O10","v":1.0670851385788487},{"$f":"R10/Q10","v":0.84433008995439796},null,null,null,null,null,null,null,null,null,null,"b1",-2.5162136196109097,null,{"$f":"T10","v":0.84433008995439796},{"$f":"$AF$11+$AF$10*S10+$AF$9*S10^2","v":0.98310339924001688},{"$f":"_xlfn.PERCENTRANK.INC(AH$9:AH$32,AH10)","v":0.34699999999999998},0.434,null,null,null,null,null,null,null,null,2,1893.0152341115049,{"$f":"AU10/$AU$4","v":1.0259324328860089},{"$error":"#REF!"},{"$f":"$AF$11+$AF$10*AV10+$AF$9*AV10^2","v":0.99218810734142937},null,"maxY",9.9108252631181095,10,null,0.21355238896608353,0.7931367944054688,0.78694089490401042,0.78798959476968466,null,0.01,"na",0.53061632288394822,0.53764604113035475,{"$f":"ABS(BL10-BK10)^2","v":4.9416938623860821E-5},null,0.97608660949454706,0.52932862933771763,null,"<Eco>",{"$f":"_xlfn.STDEV.P(AV9:AV1008)","v":0.14546777741480021},null,null,null,null,null,null,null,null,null,0,{"$f":"CC10*(maxY-minY)+minY","v":0.19619187604720059},{"$f":"_xlfn.BETA.DIST(CD10,alpha,beta,FALSE,minY,maxY)","v":0},{"$f":"_xlfn.LOGNORM.DIST(CD10,$H$15,$H$14,FALSE)","v":3.9758151222065089E-8}]
[null,1992,71.659798100000003,65.734838699999997,0.91731822364707438,null,null,null,null,null,null,null,null,1992,{"$f":"INDEX('Economic Data'!$AI$2:$AI$29,MATCH(N11,'Economic Data'!$AA$2:$AA$29,0))","v":417.21925199999993},435.64,71.659798100000003,65.734838699999997,1.0441512416114491,0.91731822364707438,null,null,null,null,null,null,null,null,null,null,"b0",2.4193128108411028,null,0.91731822364707438,0.98770795407780265,0.39100000000000001,0.56499999999999995,null,null,null,null,null,null,null,null,3,1638.8416149440188,0.88818131773963127,{"$error":"#REF!"},1.0496253246407432,null,"alpha",9.2630625859853648,0.1,null,0.71656402939558028,1.1267178634287489,1.1826316031799251,1.1213061224109047,null,0.05,{"$f":"_xlfn.PERCENTILE.INC($T$9:$T$32,BI11)","v":0.72011250087605327},0.63265613097084228,0.64059547789817639,6.303322963256961E-5,null,0.97639171098965838,0.63207816182367671,null,"<LRpred>",{"$f":"_xlfn.STDEV.P(AX9:AX1008)","v":6.5344127736048432E-2},null,null,null,null,null,null,null,null,null,0.05,0.68192354540074607,0.86155489352172265,{"$f":"_xlfn.LOGNORM.DIST(CD11,$H$15,$H$14,FALSE)","v":0.90599823992826156}]
[null,1993,73.291647699999999,54.515521100000001,0.74381628481249173,null,"mean",1,null,null,null,null,null,1993,{"$f":"INDEX('Economic Data'!$AI$2:$AI$29,MATCH(N12,'Economic Data'!$AA$2:$AA$29,0))","v":464.20388299999996},465.95,73.291647699999999,54.515521100000001,1.0037615303618648,0.74381628481249173,null,null,null,null,null,null,null,null,null,null,null,null,null,0.74381628481249173,0.99862220087681641,8.5999999999999993E-2,0.65200000000000002,null,null,null,null,null,null,null,null,4,2041.1313916874178,1.1062049880949507,{"$error":"#REF!"},0.97791143672617253,null,"beta",102.68810357598636,0.1,null,0.61493561357259752,1.0508603963415524,1.0276483999850026,1.0430096106149627,null,0.1,0.74950368224962294,0.69484735655337393,0.71111727081841469,2.647101101917769E-4,null,0.97730448261193725,0.69681501104484445,null,null,null,null,null,null,null,null,null,null,null,null,0.1,1.1676552147542916,1.0838384181546907,1.0144512611203393]
[null,1994,76.407278199999993,60.127425199999998,0.78693321652700887,null,"sd",{"$f":"_xlfn.STDEV.S(T9:T32)","v":0.2624496314374245},null,null,null,null,null,1994,{"$f":"INDEX('Economic Data'!$AI$2:$AI$29,MATCH(N13,'Economic Data'!$AA$2:$AA$29,0))","v":495.90063899999996},455.19,76.407278199999993,60.127425199999998,0.91790565327341722,0.78693321652700887,null,null,null,null,null,null,null,null,null,null,null,null,null,0.78693321652700887,1.0337097554898893,0.26,0.78200000000000003,null,null,null,null,null,null,null,null,5,1652.161320227875,0.89540002227034521,{"$error":"#REF!"},1.0455819735087748,null,"E[Impact]",{"$f":"(BA9*BA12+BA10*BA11)/(BA11+BA12)","v":1.0000000019415447},1,null,7.3707163155078886E-2,0.6651779280886071,0.69549805078536364,0.66550496172180318,null,0.2,{"$f":"_xlfn.PERCENTILE.INC($T$9:$T$32,BI13)","v":0.7783965241509434},0.77839526240037282,0.79701430776886728,3.4666885043405495E-4,null,0.98079223987932806,0.7834878319229579,null,null,null,null,null,null,null,null,null,null,null,null,0.15,1.653386884107837,9.2417556691412939E-2,0.10807873710887037]
[null,1995,76.040928899999997,58.496631600000001,0.76927823536884754,null,"sigma",{"$f":"SQRT(LN(1+(H13/H12)^2))","v":0.25809144241087806},null,null,null,null,null,1995,{"$f":"INDEX('Economic Data'!$AI$2:$AI$29,MATCH(N14,'Economic Data'!$AA$2:$AA$29,0))","v":502.08192000000003},614.57000000000005,76.040928899999997,58.496631600000001,1.2240432796305432,0.76927823536884754,null,null,null,null,null,null,null,null,null,null,null,null,null,0.76927823536884754,0.98255662162631729,0.17299999999999999,0.39100000000000001,null,null,null,null,null,null,null,null,6,1934.399299863059,1.0483608077316735,{"$error":"#REF!"},0.98677633310064983,null,"SD[Impact]",{"$f":"SQRT((BA11*BA12*(BA10-BA9)^2)/((BA11+BA12)^2*(1+BA11+BA12)))","v":0.25181975684271324},null,null,0.72460160130262374,1.1333596345935621,1.1183724643085275,1.1282447762692585,null,0.3,{"$f":"_xlfn.PERCENTILE.INC($T$9:$T$32,BI14)","v":0.83363189256045622},0.84480547853009635,0.86877451969734754,5.745149344773819E-4,null,0.98614132184992609,0.85183840782323184,null,null,null,null,null,null,null,null,null,null,null,null,0.2,2.1391185534613828,2.0931060584041938E-3,6.3868319363355377E-3]
[null,1996,73.935457799999995,58.0005466,0.78447538333900735,null,"mu",{"$f":"LN(H12/SQRT(1+(H13/H12)^2))","v":-3.3305596322863847E-2},null,null,null,null,null,1996,{"$f":"INDEX('Economic Data'!$AI$2:$AI$29,MATCH(N15,'Economic Data'!$AA$2:$AA$29,0))","v":660.9090480000001},743.25,73.935457799999995,58.0005466,1.1245874182675737,0.78447538333900735,null,null,null,null,null,null,null,null,null,null,null,null,null,0.78447538333900735,0.97663100126643343,0.217,0.13,null,null,null,null,null,null,null,null,7,2022.4543597654115,1.0960828440923289,{"$error":"#REF!"},0.97893293291622285,null,null,null,null,null,0.71510055500268932,1.1255213238551232,1.1018098906212457,1.1200575674821003,null,0.4,0.92288508233795286,0.9060214338011785,0.93012040203159729,5.8076026977073433E-4,null,0.99320897526369778,0.91416478441242,null,null,null,null,null,null,null,null,null,null,null,null,0.25,2.6248502228149282,1.868000503170544E-5,3.318894466531546E-4]
{"$rows_left_out":994}
{"sheet":"Sheet1","index":3,"n_rows":48,"n_cols":8,"rows_kept":48,"cut":false,"hidden":false,"merged":[]}
[]
[null,null,null,null,"Beta Params"]
[null,null,null,null,"a","b","c","d"]
[null,null,null,"minY",0.19619187604720059,0.23849668776385241,0.2244761482567417,0.22395948855030542]
[null,null,null,"maxY",9.9108252631181095,6.0228042547559006,7.2955699723093215,7.9177862281198692]
[null,null,null,"alpha",9.2630625859853648,7.7293851001194023,8.2972330657877365,8.492077595331164]
[null,null,null,"beta",102.68810357598636,50.982298144788039,67.355551383722698,75.70017269521108]
[null,null,null,"E[Impact]",1.0000000019415447,0.99999999088528446,0.99999966553550579,0.99999972327483211]
[null,null,null,"SD[Impact]",0.25181975684271324,0.25309255256561614,0.25237774609492797,0.25103001474055031]
[]
[]
[null,null,null,null,"LR dist"]
[null,null,null,"LR orig","a","b","c","d"]
[null,null,1E-3,0.43567091200616342,0.43435080367890866,0.43751925974901079,0.43752099369856001,0.44039796803880293]
[null,null,0.01,0.53061632288394822,0.53764604113035475,0.5374763210896486,0.53858689743818278,0.54144209994778347]
{"$rows_left_out":34}
{"sheet":"Models","index":4,"n_rows":39,"n_cols":8,"rows_kept":39,"cut":false,"hidden":false,"merged":[[35,3,35,7]]}
[]
[]
[]
[null,null,null,-1,{"$f":"-1+D4","v":-2},{"$f":"-1+E4","v":-3},{"$f":"-1+F4","v":-4},{"$f":"-1+G4","v":-5}]
[null,null,null,"Year","SP0","LR0","LR0:Quad","LR err:\nQuad"]
[null,null,null,{"$f":"Calculations!N9","v":1990},{"$f":"Calculations!S9","v":0.91405772118111539},{"$f":"Calculations!T9","v":1.0347334531606585},{"$f":"$F$39+$F$38*E6+$F$37*E6^2","v":1.0356608872110742},{"$f":"F6/G6","v":0.99910450026464437}]
[null,"LR err Quad",null,{"$f":"Calculations!N10","v":1991},{"$f":"Calculations!S10","v":1.0670851385788487},{"$f":"Calculations!T10","v":0.84433008995439796},{"$f":"$F$39+$F$38*E7+$F$37*E7^2","v":0.98310339924001688},{"$f":"F7/G7","v":0.85884159347541988}]
["SP0",{"$f":"CORREL(H6:H29,E6:E29)","v":-8.1322840734592023E-3},null,{"$f":"Calculations!N11","v":1992},{"$f":"Calculations!S11","v":1.0441512416114491},{"$f":"Calculations!T11","v":0.91731822364707438},0.98770795407780265,0.92873426791783875]
["LR0",{"$f":"CORREL(F6:F29,H6:H29)","v":0.95551424545585628},null,{"$f":"Calculations!N12","v":1993},{"$f":"Calculations!S12","v":1.0037615303618648},{"$f":"Calculations!T12","v":0.74381628481249173},0.99862220087681641,0.74484252819474828]
["LR0:Quad",{"$f":"CORREL(G6:G29,H6:H29)","v":2.5106987505666149E-2},null,{"$f":"Calculations!N13","v":1994},{"$f":"Calculations!S13","v":0.91790565327341722},{"$f":"Calculations!T13","v":0.78693321652700887},1.0337097554898893,0.76127095864938454]
[null,null,null,{"$f":"Calculations!N14","v":1995},{"$f":"Calculations!S14","v":1.2240432796305432},{"$f":"Calculations!T14","v":0.76927823536884754},0.98255662162631729,0.78293527155264231]
[null,null,null,{"$f":"Calculations!N15","v":1996},{"$f":"Calculations!S15","v":1.1245874182675737},{"$f":"Calculations!T15","v":0.78447538333900735},0.97663100126643343,0.80324644857858207]
[null,null,null,{"$f":"Calculations!N16","v":1997},{"$f":"Calculations!S16","v":1.2030766945359996},{"$f":"Calculations!T16","v":0.94515251710146653},0.97950260182682625,0.9649310939437068]
[null,null,null,{"$f":"Calculations!N17","v":1998},{"$f":"Calculations!S17","v":1.1534279285354103},{"$f":"Calculations!T17","v":1.3016888837271223},0.97611576620128249,1.3335394517730843]
[null,null,null,{"$f":"Calculations!N18","v":1999},{"$f":"Calculations!S18","v":1.1330698626816609},{"$f":"Calculations!T18","v":1.5923782644138373},0.97629007394404321,1.6310503475477367]
{"$rows_left_out":25}
{"sheet":"Economic Data","index":5,"n_rows":35,"n_cols":41,"rows_kept":35,"cut":false,"hidden":false,"merged":[]}
["Year","S&P Composite","Dividend","Earnings","CPI","Long Interest Rate","Real Price","Real Dividend","Real Earnings","Cyclically Adjusted PE Ratio",null,null,null,"Date","1 MO","3 MO","6 MO","1 YR","2 YR","3 YR","5 YR","7 YR","10 YR","20 YR","30 YR",null,"Year","x1","x2","x3","x4","y","1yr prior","y-pred","simple growth"]
["2017-12-31",2659.99,48.17,104.02,246.54599999999999,2.37,2659.99,48.116720430760999,104.69561723582,32.441555635926001,{"$f":"B3*(1+R2/100)*1.02","v":2331.89410176},null,null,"2017-12-31",1.19,1.39,1.54,1.76,1.91,2,2.23,2.36,2.4300000000000002,2.6,2.75,null,2017,{"$f":"B3","v":2246.63},{"$f":"C3","v":45.7},{"$f":"R3","v":0.85},{"$f":"E3/E4-1","v":2.074622132966919E-2},{"$f":"B2","v":2659.99},{"$f":"B3","v":2246.63},{"$f":"$AK$4+SUMPRODUCT(AB2:AE2,$AL$4:$AO$4)","v":2415.220591023085},{"$f":"(B3+C3)*(1+R3/100)","v":2311.814805}]
["2016-12-31",2246.63,45.7,94.55,241.43199999999999,2.4900000000000002,2294.2179991881999,46.668015010437998,96.552753156167995,27.865098223924001,{"$f":"B4*(1+R3/100)*1.02","v":2112.9704735999999},null,null,"2016-12-31",0.44,0.51,0.62,0.85,1.2,1.47,1.93,2.25,2.4500000000000002,2.79,3.06,null,2016,{"$f":"B4","v":2054.08},{"$f":"C4","v":43.39},0.65,{"$f":"E4/E5-1","v":7.2951978604158807E-3},{"$f":"B3","v":2246.63},{"$f":"B4","v":2054.08},2318.5762467124205,{"$f":"(B4+C4)*(1+R4/100)","v":2111.1035549999997},null,5,4,3,2,1]
["2015-12-31",2054.08,43.39,86.53,236.52500000000001,2.2400000000000002,2141.1064694217998,45.228330789556999,90.196069675510003,25.965424037123999,2108.9752100999999,null,null,"2015-12-31",0.14000000000000001,0.16,0.49,0.65,1.06,1.31,1.76,2.09,2.27,2.67,3.01,null,2015,2054.27,39.44,0.25,7.564932696557447E-3,2054.08,2054.27,2247.5036245726997,2098.9442749999998,null,{"$f":"INDEX(LINEST(AF2:AF29,AB2:AE29,TRUE,FALSE),,AK3:AO3)","v":158.37786164698832},0.72045268292805198,16.553186422760398,10.42997987552574,-6126.1268770492698]
["2014-12-31",2054.27,39.44,102.31,234.81200000000001,2.21,2156.9257594159999,41.410891436553001,107.42262431221999,26.794085482572999,1848.545439,null,null,"2014-12-31",0.03,0.04,0.12,0.25,0.67,1.1000000000000001,1.65,1.97,2.17,2.4700000000000002,2.75,null,2014,1807.78,34.99,0.13,1.501735619618394E-2,2054.27,1807.78,1949.351473691202,1845.1656010000002]
["2013-12-31",1807.78,34.99,100.2,233.04900000000001,2.9,1912.4773239962001,37.016440920150004,106.00306888250999,24.861869296462,1452.6217565400002,null,null,"2013-12-31",0.01,7.0000000000000007E-2,0.1,0.13,0.38,0.78,1.75,2.4500000000000002,3.04,3.72,3.96,null,2013,1422.29,31.25,0.16,1.7410223687475579E-2,1807.78,1422.29,1595.3691412727901,1455.8656639999999]
["2012-12-31",1422.29,31.25,86.51,229.601,1.72,1527.2577660376,33.556310730353999,92.894606121053997,21.238261139845999,1270.2154982400002,null,null,"2012-12-31",0.02,0.05,0.11,0.16,0.25,0.36,0.72,1.18,1.78,2.54,2.95,null,2012,1243.32,26.43,0.12,2.9624188448710953E-2,1422.29,1243.32,1311.4018690572937,1271.2737000000002]
["2011-12-31",1243.32,26.43,86.95,225.672,1.98,1358.3234637881999,28.874697702860999,94.992620706157993,20.523575499431999,1267.8802327200001,null,null,"2011-12-31",0.01,0.02,0.06,0.12,0.25,0.36,0.83,1.35,1.89,2.57,2.89,null,2011,1241.53,22.73,0.28999999999999998,1.4957235273143077E-2,1243.32,1241.53,1340.4901816227477,1267.9263539999999]
["2010-12-31",1241.53,22.73,77.349999999999994,219.179,3.29,1396.5491921215,25.568099954830998,87.008030422622994,22.396379773044,1135.8721040400001,null,null,"2010-12-31",7.0000000000000007E-2,0.12,0.19,0.28999999999999998,0.61,1.02,2.0099999999999998,2.71,3.3,4.13,4.34,null,2010,1110.3800000000001,22.41,0.47,2.7213311262058282E-2,1241.53,1110.3800000000001,1167.5009124561934,1138.1141130000001]
["2009-12-31",1110.3800000000001,22.41,50.97,215.94900000000001,3.59,1267.7055577010999,25.585188447271999,58.191747218092999,20.322376500217,899.31822263999993,null,null,"2009-12-31",0.04,0.06,0.2,0.47,1.1399999999999999,1.7,2.69,3.39,3.85,4.58,4.63,null,2009,877.56,28.39,0.37,9.1412900645604367E-4,1110.3800000000001,877.56,1258.8223028979012,909.30201499999998]
["2008-12-31",877.56,28.39,14.88,210.22800000000001,2.42,1029.1631360237,33.294522803813003,17.450598778469001,15.376080747424,1514.3869762800002,null,null,"2008-12-31",0.11,0.11,0.27,0.37,0.76,1,1.55,1.87,2.25,3.05,2.69,null,2008,1479.22,27.73,3.34,4.0812685827551931E-2,877.56,1479.22,1467.9181800024896,1557.2821300000003]
["2007-12-31",1479.22,27.73,66.180000000000007,210.036,4.0999999999999996,1736.3488836199999,32.550232245901,77.683893618236993,25.955510105239998,1493.0029965600002,null,null,"2007-12-31",2.76,3.36,3.49,3.34,3.05,3.07,3.45,3.7,4.04,4.5,4.45,null,2007,1416.42,24.88,5,2.5406504065040636E-2,1479.22,1416.42,1487.1911609711401,1513.3650000000002]
["2006-12-31",1416.42,24.88,81.510000000000005,201.8,4.5599999999999996,1730.4890253717001,30.396751635282001,99.583570168484002,27.282689787572,1351.67697,null,null,"2006-12-31",4.75,5.0199999999999996,5.09,5,4.82,4.74,4.7,4.7,4.71,4.91,4.8099999999999996,null,2006,1262.07,22.22,4.38,3.4156594850236477E-2,1416.42,1262.07,1271.887059618017,1340.5419019999999]
["2005-12-31",1262.07,22.22,69.83,196.8,4.47,1581.0889746951,27.836646951220001,87.481235670732005,26.443803114291999,1276.7701059600001,null,null,"2005-12-31",4.01,4.08,4.37,4.38,4.41,4.37,4.3499999999999996,4.3600000000000003,4.3899999999999997,4.6100000000000003,null,null,2005,1199.21,19.440000000000001,2.75,3.255561584373301E-2,1262.07,1199.21,1173.3884790381119,1252.1628750000002]
["2004-12-31",1199.21,19.440000000000001,58.55,190.3,4.2300000000000004,1553.6543807672001,25.185781607987,75.855324750394004,27.144808694740998,1132.5647520000002,null,null,"2004-12-31",1.89,2.2200000000000002,2.59,2.75,3.08,3.25,3.63,3.94,4.24,4.8499999999999996,null,null,2004,1080.6400000000001,17.39,1.26,1.8794914317302513E-2,1199.21,1080.6400000000001,1122.7895057102592,1111.8651780000002]
{"$rows_left_out":20}